Welcome, guest! Login / Register - Why register?
[email protected] webmail now available. Want one? Go here.

Paste

Pasted as Plain Text by wlan ( 11 years ago )
[2] [email protected]> make                                                                                                                        ~/BARDY_LINUX
make -C ./ADP64Z4
make[1]: Entering directory `/home/wlan/BARDY_LINUX/ADP64Z4'
make -C ./B64Z4
make[2]: Entering directory `/home/wlan/BARDY_LINUX/ADP64Z4/B64Z4'
g++ -I ../../BRDINC -I ../W64Z4 -I ../../BRDLIBS -I ../../WDMLIBS -fPIC -Wall -g -DDZY_LINUX -D_BARDY_USE_SYSTEMV_IPC_ -D__LINUX__  -c -MD ../../BRDLIBS/bserv.cpp
g++ -I ../../BRDINC -I ../W64Z4 -I ../../BRDLIBS -I ../../WDMLIBS -fPIC -Wall -g -DDZY_LINUX -D_BARDY_USE_SYSTEMV_IPC_ -D__LINUX__  -c -MD ../../BRDLIBS/basestrm.cpp
g++ -g -shared -rdynamic -Wl,-soname,libB64Z4p.so.0 \
        -o libB64Z4p.so.0.0 -ldl -lpthread -lc -lrt *.o
chmod 666 libB64Z4p.so.0.0
make[2]: Leaving directory `/home/wlan/BARDY_LINUX/ADP64Z4/B64Z4'
make -C ./W64Z4
make[2]: Entering directory `/home/wlan/BARDY_LINUX/ADP64Z4/W64Z4'
cc -DDZYTOOLS_2_6_X -pipe -O -Wall -DMODULE -D__KERNEL__ -DLINUX -I /usr/src/linux-headers-2.6.32-bpo.5-common/include -I /home/wlan/BARDY_LINUX/BRDINC -I /home/wlan/BARDY_LINUX/WDMLIBS -I /home/wlan/BARDY_LINUX/BRDLIBS -I /lib/modules/2.6.32-bpo.5-686/build  -I /usr/src/linux-headers-2.6.32-bpo.5-common/arch/x86/include -c -MD devproc.c
In file included from /usr/src/linux-headers-2.6.32-bpo.5-common/include/linux/prefetch.h:14,
                 from /usr/src/linux-headers-2.6.32-bpo.5-common/include/linux/list.h:6,
                 from /usr/src/linux-headers-2.6.32-bpo.5-common/include/linux/module.h:9,
                 from devproc.c:4:
/usr/src/linux-headers-2.6.32-bpo.5-common/arch/x86/include/asm/processor.h:116: error: ‘CONFIG_X86_L1_CACHE_SHIFT’ undeclared here (not in a function)
/usr/src/linux-headers-2.6.32-bpo.5-common/arch/x86/include/asm/processor.h:116: error: requested alignment is not a constant
In file included from /usr/src/linux-headers-2.6.32-bpo.5-common/include/linux/prefetch.h:14,
                 from /usr/src/linux-headers-2.6.32-bpo.5-common/include/linux/list.h:6,
                 from /usr/src/linux-headers-2.6.32-bpo.5-common/include/linux/module.h:9,
                 from devproc.c:4:
/usr/src/linux-headers-2.6.32-bpo.5-common/arch/x86/include/asm/processor.h:162:1: warning: "cache_line_size" redefined
In file included from /usr/src/linux-headers-2.6.32-bpo.5-common/arch/x86/include/asm/processor.h:28,
                 from /usr/src/linux-headers-2.6.32-bpo.5-common/include/linux/prefetch.h:14,
                 from /usr/src/linux-headers-2.6.32-bpo.5-common/include/linux/list.h:6,
                 from /usr/src/linux-headers-2.6.32-bpo.5-common/include/linux/module.h:9,
                 from devproc.c:4:
/usr/src/linux-headers-2.6.32-bpo.5-common/include/linux/cache.h:64:1: warning: this is the location of the previous definition
/usr/src/linux-headers-2.6.32-bpo.5-common/arch/x86/include/asm/processor.h: In function ‘load_cr3’:
/usr/src/linux-headers-2.6.32-bpo.5-common/arch/x86/include/asm/processor.h:193: error: ‘CONFIG_PAGE_OFFSETUL’ undeclared (first use in this function)
/usr/src/linux-headers-2.6.32-bpo.5-common/arch/x86/include/asm/processor.h:193: error: (Each undeclared identifier is reported only once
/usr/src/linux-headers-2.6.32-bpo.5-common/arch/x86/include/asm/processor.h:193: error: for each function it appears in.)
/usr/src/linux-headers-2.6.32-bpo.5-common/arch/x86/include/asm/processor.h: At top level:
/usr/src/linux-headers-2.6.32-bpo.5-common/arch/x86/include/asm/processor.h:242: error: requested alignment is not a constant
/usr/src/linux-headers-2.6.32-bpo.5-common/arch/x86/include/asm/processor.h:273: error: requested alignment is not a constant
/usr/src/linux-headers-2.6.32-bpo.5-common/arch/x86/include/asm/processor.h: In function ‘wbinvd_halt’:
/usr/src/linux-headers-2.6.32-bpo.5-common/arch/x86/include/asm/processor.h:788: warning: implicit declaration of function ‘halt’
In file included from /usr/src/linux-headers-2.6.32-bpo.5-common/arch/x86/include/asm/atomic.h:4,
                 from /usr/src/linux-headers-2.6.32-bpo.5-common/arch/x86/include/asm/thread_info.h:24,
                 from /usr/src/linux-headers-2.6.32-bpo.5-common/include/linux/thread_info.h:56,
                 from /usr/src/linux-headers-2.6.32-bpo.5-common/include/linux/preempt.h:9,
                 from /usr/src/linux-headers-2.6.32-bpo.5-common/include/linux/spinlock.h:50,
                 from /usr/src/linux-headers-2.6.32-bpo.5-common/include/linux/seqlock.h:29,
                 from /usr/src/linux-headers-2.6.32-bpo.5-common/include/linux/time.h:8,
                 from /usr/src/linux-headers-2.6.32-bpo.5-common/include/linux/stat.h:60,
                 from /usr/src/linux-headers-2.6.32-bpo.5-common/include/linux/module.h:10,
                 from devproc.c:4:
/usr/src/linux-headers-2.6.32-bpo.5-common/arch/x86/include/asm/atomic_64.h: At top level:
/usr/src/linux-headers-2.6.32-bpo.5-common/arch/x86/include/asm/atomic_64.h:201: warning: type defaults to ‘int’ in declaration of ‘atomic64_t’
/usr/src/linux-headers-2.6.32-bpo.5-common/arch/x86/include/asm/atomic_64.h:201: error: expected ‘;’, ‘,’ or ‘)’ before ‘*’ token
/usr/src/linux-headers-2.6.32-bpo.5-common/arch/x86/include/asm/atomic_64.h:213: error: expected ‘)’ before ‘*’ token
/usr/src/linux-headers-2.6.32-bpo.5-common/arch/x86/include/asm/atomic_64.h:225: error: expected declaration specifiers or ‘...’ before ‘atomic64_t’
/usr/src/linux-headers-2.6.32-bpo.5-common/arch/x86/include/asm/atomic_64.h: In function ‘atomic64_add’:
/usr/src/linux-headers-2.6.32-bpo.5-common/arch/x86/include/asm/atomic_64.h:228: error: ‘v’ undeclared (first use in this function)
/usr/src/linux-headers-2.6.32-bpo.5-common/arch/x86/include/asm/atomic_64.h:227: error: invalid lvalue in asm output 0
/usr/src/linux-headers-2.6.32-bpo.5-common/arch/x86/include/asm/atomic_64.h:227: error: memory input 2 is not directly addressable
/usr/src/linux-headers-2.6.32-bpo.5-common/arch/x86/include/asm/atomic_64.h: At top level:
/usr/src/linux-headers-2.6.32-bpo.5-common/arch/x86/include/asm/atomic_64.h:239: error: expected declaration specifiers or ‘...’ before ‘atomic64_t’
/usr/src/linux-headers-2.6.32-bpo.5-common/arch/x86/include/asm/atomic_64.h: In function ‘atomic64_sub’:
/usr/src/linux-headers-2.6.32-bpo.5-common/arch/x86/include/asm/atomic_64.h:242: error: ‘v’ undeclared (first use in this function)
/usr/src/linux-headers-2.6.32-bpo.5-common/arch/x86/include/asm/atomic_64.h:241: error: invalid lvalue in asm output 0
/usr/src/linux-headers-2.6.32-bpo.5-common/arch/x86/include/asm/atomic_64.h:241: error: memory input 2 is not directly addressable
/usr/src/linux-headers-2.6.32-bpo.5-common/arch/x86/include/asm/atomic_64.h: At top level:
/usr/src/linux-headers-2.6.32-bpo.5-common/arch/x86/include/asm/atomic_64.h:255: error: expected declaration specifiers or ‘...’ before ‘atomic64_t’
/usr/src/linux-headers-2.6.32-bpo.5-common/arch/x86/include/asm/atomic_64.h: In function ‘atomic64_sub_and_test’:
/usr/src/linux-headers-2.6.32-bpo.5-common/arch/x86/include/asm/atomic_64.h:260: error: ‘v’ undeclared (first use in this function)
/usr/src/linux-headers-2.6.32-bpo.5-common/arch/x86/include/asm/atomic_64.h:259: error: invalid lvalue in asm output 0
/usr/src/linux-headers-2.6.32-bpo.5-common/arch/x86/include/asm/atomic_64.h:259: error: memory input 3 is not directly addressable
/usr/src/linux-headers-2.6.32-bpo.5-common/arch/x86/include/asm/atomic_64.h: At top level:
/usr/src/linux-headers-2.6.32-bpo.5-common/arch/x86/include/asm/atomic_64.h:271: error: expected ‘)’ before ‘*’ token
/usr/src/linux-headers-2.6.32-bpo.5-common/arch/x86/include/asm/atomic_64.h:284: error: expected ‘)’ before ‘*’ token
/usr/src/linux-headers-2.6.32-bpo.5-common/arch/x86/include/asm/atomic_64.h:299: error: expected ‘)’ before ‘*’ token
/usr/src/linux-headers-2.6.32-bpo.5-common/arch/x86/include/asm/atomic_64.h:317: error: expected ‘)’ before ‘*’ token
/usr/src/linux-headers-2.6.32-bpo.5-common/arch/x86/include/asm/atomic_64.h:336: error: expected declaration specifiers or ‘...’ before ‘atomic64_t’
/usr/src/linux-headers-2.6.32-bpo.5-common/arch/x86/include/asm/atomic_64.h: In function ‘atomic64_add_negative’:
/usr/src/linux-headers-2.6.32-bpo.5-common/arch/x86/include/asm/atomic_64.h:341: error: ‘v’ undeclared (first use in this function)
/usr/src/linux-headers-2.6.32-bpo.5-common/arch/x86/include/asm/atomic_64.h:340: error: invalid lvalue in asm output 0
/usr/src/linux-headers-2.6.32-bpo.5-common/arch/x86/include/asm/atomic_64.h:340: error: memory input 3 is not directly addressable
/usr/src/linux-headers-2.6.32-bpo.5-common/arch/x86/include/asm/atomic_64.h: At top level:
/usr/src/linux-headers-2.6.32-bpo.5-common/arch/x86/include/asm/atomic_64.h:353: error: expected declaration specifiers or ‘...’ before ‘atomic64_t’
/usr/src/linux-headers-2.6.32-bpo.5-common/arch/x86/include/asm/atomic_64.h: In function ‘atomic64_add_return’:
/usr/src/linux-headers-2.6.32-bpo.5-common/arch/x86/include/asm/atomic_64.h:357: error: ‘v’ undeclared (first use in this function)
/usr/src/linux-headers-2.6.32-bpo.5-common/arch/x86/include/asm/atomic_64.h:356: error: invalid lvalue in asm output 1
/usr/src/linux-headers-2.6.32-bpo.5-common/arch/x86/include/asm/atomic_64.h:356: error: memory input 3 is not directly addressable
/usr/src/linux-headers-2.6.32-bpo.5-common/arch/x86/include/asm/atomic_64.h: At top level:
/usr/src/linux-headers-2.6.32-bpo.5-common/arch/x86/include/asm/atomic_64.h:362: error: expected declaration specifiers or ‘...’ before ‘atomic64_t’
/usr/src/linux-headers-2.6.32-bpo.5-common/arch/x86/include/asm/atomic_64.h: In function ‘atomic64_sub_return’:
/usr/src/linux-headers-2.6.32-bpo.5-common/arch/x86/include/asm/atomic_64.h:364: error: ‘v’ undeclared (first use in this function)
/usr/src/linux-headers-2.6.32-bpo.5-common/arch/x86/include/asm/atomic_64.h:364: error: too many arguments to function ‘atomic64_add_return’
/usr/src/linux-headers-2.6.32-bpo.5-common/arch/x86/include/asm/atomic_64.h: At top level:
/usr/src/linux-headers-2.6.32-bpo.5-common/arch/x86/include/asm/atomic_64.h:370: error: expected ‘)’ before ‘*’ token
/usr/src/linux-headers-2.6.32-bpo.5-common/arch/x86/include/asm/atomic_64.h:375: error: expected ‘)’ before ‘*’ token
/usr/src/linux-headers-2.6.32-bpo.5-common/arch/x86/include/asm/atomic_64.h:425: error: expected ‘)’ before ‘*’ token
In file included from /usr/src/linux-headers-2.6.32-bpo.5-common/include/linux/mmzone.h:16,
                 from /usr/src/linux-headers-2.6.32-bpo.5-common/include/linux/gfp.h:4,
                 from /usr/src/linux-headers-2.6.32-bpo.5-common/include/linux/kmod.h:22,
                 from /usr/src/linux-headers-2.6.32-bpo.5-common/include/linux/module.h:13,
                 from devproc.c:4:
/usr/src/linux-headers-2.6.32-bpo.5-common/include/linux/nodemask.h: In function ‘__first_node’:
/usr/src/linux-headers-2.6.32-bpo.5-common/include/linux/nodemask.h:239: warning: implicit declaration of function ‘find_first_bit’
/usr/src/linux-headers-2.6.32-bpo.5-common/include/linux/nodemask.h: In function ‘__next_node’:
/usr/src/linux-headers-2.6.32-bpo.5-common/include/linux/nodemask.h:245: warning: implicit declaration of function ‘find_next_bit’
/usr/src/linux-headers-2.6.32-bpo.5-common/include/linux/nodemask.h: In function ‘__first_unset_node’:
/usr/src/linux-headers-2.6.32-bpo.5-common/include/linux/nodemask.h:263: warning: implicit declaration of function ‘find_first_zero_bit’
In file included from /usr/src/linux-headers-2.6.32-bpo.5-common/include/linux/gfp.h:4,
                 from /usr/src/linux-headers-2.6.32-bpo.5-common/include/linux/kmod.h:22,
                 from /usr/src/linux-headers-2.6.32-bpo.5-common/include/linux/module.h:13,
                 from devproc.c:4:
/usr/src/linux-headers-2.6.32-bpo.5-common/include/linux/mmzone.h:18:26: error: linux/bounds.h: Нет такого файла или каталога
/usr/src/linux-headers-2.6.32-bpo.5-common/include/linux/mmzone.h:18:26: error: linux/bounds.h: Нет такого файла или каталога
In file included from /usr/src/linux-headers-2.6.32-bpo.5-common/include/linux/gfp.h:4,
                 from /usr/src/linux-headers-2.6.32-bpo.5-common/include/linux/kmod.h:22,
                 from /usr/src/linux-headers-2.6.32-bpo.5-common/include/linux/module.h:13,
                 from devproc.c:4:
/usr/src/linux-headers-2.6.32-bpo.5-common/include/linux/mmzone.h: At top level:
/usr/src/linux-headers-2.6.32-bpo.5-common/include/linux/mmzone.h:300: error: ‘MAX_NR_ZONES’ undeclared here (not in a function)
In file included from /usr/src/linux-headers-2.6.32-bpo.5-common/include/linux/gfp.h:8,
                 from /usr/src/linux-headers-2.6.32-bpo.5-common/include/linux/kmod.h:22,
                 from /usr/src/linux-headers-2.6.32-bpo.5-common/include/linux/module.h:13,
                 from devproc.c:4:
/usr/src/linux-headers-2.6.32-bpo.5-common/include/linux/mmdebug.h:4:28: error: linux/autoconf.h: Нет такого файла или каталога
In file included from /usr/src/linux-headers-2.6.32-bpo.5-common/include/linux/elf.h:7,
                 from /usr/src/linux-headers-2.6.32-bpo.5-common/include/linux/module.h:14,
                 from devproc.c:4:
/usr/src/linux-headers-2.6.32-bpo.5-common/arch/x86/include/asm/elf.h: In function ‘start_ia32_thread’:
/usr/src/linux-headers-2.6.32-bpo.5-common/arch/x86/include/asm/elf.h:165: warning: implicit declaration of function ‘load_gs_index’
/usr/src/linux-headers-2.6.32-bpo.5-common/arch/x86/include/asm/elf.h: In function ‘elf_common_init’:
/usr/src/linux-headers-2.6.32-bpo.5-common/arch/x86/include/asm/elf.h:178: error: ‘struct pt_regs’ has no member named ‘r8’
/usr/src/linux-headers-2.6.32-bpo.5-common/arch/x86/include/asm/elf.h:178: error: ‘struct pt_regs’ has no member named ‘r9’
/usr/src/linux-headers-2.6.32-bpo.5-common/arch/x86/include/asm/elf.h:178: error: ‘struct pt_regs’ has no member named ‘r10’
/usr/src/linux-headers-2.6.32-bpo.5-common/arch/x86/include/asm/elf.h:178: error: ‘struct pt_regs’ has no member named ‘r11’
/usr/src/linux-headers-2.6.32-bpo.5-common/arch/x86/include/asm/elf.h:179: error: ‘struct pt_regs’ has no member named ‘r12’
/usr/src/linux-headers-2.6.32-bpo.5-common/arch/x86/include/asm/elf.h:179: error: ‘struct pt_regs’ has no member named ‘r13’
/usr/src/linux-headers-2.6.32-bpo.5-common/arch/x86/include/asm/elf.h:179: error: ‘struct pt_regs’ has no member named ‘r14’
/usr/src/linux-headers-2.6.32-bpo.5-common/arch/x86/include/asm/elf.h:179: error: ‘struct pt_regs’ has no member named ‘r15’
/usr/src/linux-headers-2.6.32-bpo.5-common/arch/x86/include/asm/elf.h:180: error: ‘struct thread_struct’ has no member named ‘fs’
In file included from /usr/src/linux-headers-2.6.32-bpo.5-common/include/linux/tracepoint.h:18,
                 from /usr/src/linux-headers-2.6.32-bpo.5-common/include/linux/module.h:18,
                 from devproc.c:4:
/usr/src/linux-headers-2.6.32-bpo.5-common/include/linux/rcupdate.h:77:2: error: #error "Unknown RCU implementation specified to kernel configuration"
In file included from /usr/src/linux-headers-2.6.32-bpo.5-common/include/linux/tracepoint.h:18,
                 from /usr/src/linux-headers-2.6.32-bpo.5-common/include/linux/module.h:18,
                 from devproc.c:4:
/usr/src/linux-headers-2.6.32-bpo.5-common/include/linux/rcupdate.h: In function ‘rcu_read_lock’:
/usr/src/linux-headers-2.6.32-bpo.5-common/include/linux/rcupdate.h:127: warning: implicit declaration of function ‘__rcu_read_lock’
/usr/src/linux-headers-2.6.32-bpo.5-common/include/linux/rcupdate.h: In function ‘rcu_read_unlock’:
/usr/src/linux-headers-2.6.32-bpo.5-common/include/linux/rcupdate.h:151: warning: implicit declaration of function ‘__rcu_read_unlock’
/usr/src/linux-headers-2.6.32-bpo.5-common/include/linux/rcupdate.h: In function ‘rcu_read_lock_bh’:
/usr/src/linux-headers-2.6.32-bpo.5-common/include/linux/rcupdate.h:167: warning: implicit declaration of function ‘__rcu_read_lock_bh’
/usr/src/linux-headers-2.6.32-bpo.5-common/include/linux/rcupdate.h: In function ‘rcu_read_unlock_bh’:
/usr/src/linux-headers-2.6.32-bpo.5-common/include/linux/rcupdate.h:181: warning: implicit declaration of function ‘__rcu_read_unlock_bh’
In file included from /usr/src/linux-headers-2.6.32-bpo.5-common/include/linux/module.h:21,
                 from devproc.c:4:
/usr/src/linux-headers-2.6.32-bpo.5-common/arch/x86/include/asm/module.h:59:2: error: #error unknown processor family
In file included from /usr/src/linux-headers-2.6.32-bpo.5-common/include/linux/ktime.h:25,
                 from /usr/src/linux-headers-2.6.32-bpo.5-common/include/linux/timer.h:5,
                 from /usr/src/linux-headers-2.6.32-bpo.5-common/include/linux/workqueue.h:8,
                 from /usr/src/linux-headers-2.6.32-bpo.5-common/include/linux/pm.h:25,
                 from /usr/src/linux-headers-2.6.32-bpo.5-common/include/linux/device.h:24,
                 from /usr/src/linux-headers-2.6.32-bpo.5-common/include/linux/pci.h:53,
                 from devproc.c:7:
/usr/src/linux-headers-2.6.32-bpo.5-common/include/linux/jiffies.h:39:3: error: #error Invalid value of HZ.
/usr/src/linux-headers-2.6.32-bpo.5-common/include/linux/jiffies.h:257:31: error: division by zero in #if
/usr/src/linux-headers-2.6.32-bpo.5-common/include/linux/jiffies.h:257:31: error: division by zero in #if
/usr/src/linux-headers-2.6.32-bpo.5-common/include/linux/jiffies.h:257:31: error: division by zero in #if
/usr/src/linux-headers-2.6.32-bpo.5-common/include/linux/jiffies.h:257:31: error: division by zero in #if
/usr/src/linux-headers-2.6.32-bpo.5-common/include/linux/jiffies.h:257:31: error: division by zero in #if
/usr/src/linux-headers-2.6.32-bpo.5-common/include/linux/jiffies.h:257:31: error: division by zero in #if
/usr/src/linux-headers-2.6.32-bpo.5-common/include/linux/jiffies.h:257:31: error: division by zero in #if
/usr/src/linux-headers-2.6.32-bpo.5-common/include/linux/jiffies.h:257:31: error: division by zero in #if
/usr/src/linux-headers-2.6.32-bpo.5-common/include/linux/jiffies.h:257:31: error: division by zero in #if
/usr/src/linux-headers-2.6.32-bpo.5-common/include/linux/jiffies.h:257:31: error: division by zero in #if
/usr/src/linux-headers-2.6.32-bpo.5-common/include/linux/jiffies.h:257:31: error: division by zero in #if
/usr/src/linux-headers-2.6.32-bpo.5-common/include/linux/jiffies.h:257:31: error: division by zero in #if
/usr/src/linux-headers-2.6.32-bpo.5-common/include/linux/jiffies.h:257:31: error: division by zero in #if
/usr/src/linux-headers-2.6.32-bpo.5-common/include/linux/jiffies.h:257:31: error: division by zero in #if
In file included from /usr/src/linux-headers-2.6.32-bpo.5-common/include/linux/io.h:22,
                 from /usr/src/linux-headers-2.6.32-bpo.5-common/include/linux/pci.h:54,
                 from devproc.c:7:
/usr/src/linux-headers-2.6.32-bpo.5-common/arch/x86/include/asm/io.h: In function ‘virt_to_phys’:
/usr/src/linux-headers-2.6.32-bpo.5-common/arch/x86/include/asm/io.h:99: error: ‘CONFIG_PAGE_OFFSETUL’ undeclared (first use in this function)
/usr/src/linux-headers-2.6.32-bpo.5-common/arch/x86/include/asm/io.h: In function ‘phys_to_virt’:
/usr/src/linux-headers-2.6.32-bpo.5-common/arch/x86/include/asm/io.h:117: error: ‘CONFIG_PAGE_OFFSETUL’ undeclared (first use in this function)
In file included from /usr/src/linux-headers-2.6.32-bpo.5-common/include/linux/mm.h:39,
                 from /usr/src/linux-headers-2.6.32-bpo.5-common/arch/x86/include/asm/pci.h:4,
                 from /usr/src/linux-headers-2.6.32-bpo.5-common/include/linux/pci.h:1131,
                 from devproc.c:7:
/usr/src/linux-headers-2.6.32-bpo.5-common/arch/x86/include/asm/pgtable.h: In function ‘pmd_page_vaddr’:
/usr/src/linux-headers-2.6.32-bpo.5-common/arch/x86/include/asm/pgtable.h:342: error: ‘CONFIG_PAGE_OFFSETUL’ undeclared (first use in this function)
/usr/src/linux-headers-2.6.32-bpo.5-common/arch/x86/include/asm/pgtable.h: In function ‘pud_page_vaddr’:
/usr/src/linux-headers-2.6.32-bpo.5-common/arch/x86/include/asm/pgtable.h:413: error: ‘CONFIG_PAGE_OFFSETUL’ undeclared (first use in this function)
/usr/src/linux-headers-2.6.32-bpo.5-common/arch/x86/include/asm/pgtable.h: In function ‘pgd_page_vaddr’:
/usr/src/linux-headers-2.6.32-bpo.5-common/arch/x86/include/asm/pgtable.h:453: error: ‘CONFIG_PAGE_OFFSETUL’ undeclared (first use in this function)
In file included from /usr/src/linux-headers-2.6.32-bpo.5-common/arch/x86/include/asm/pci.h:4,
                 from /usr/src/linux-headers-2.6.32-bpo.5-common/include/linux/pci.h:1131,
                 from devproc.c:7:
/usr/src/linux-headers-2.6.32-bpo.5-common/include/linux/mm.h: In function ‘virt_to_head_page’:
/usr/src/linux-headers-2.6.32-bpo.5-common/include/linux/mm.h:318: warning: implicit declaration of function ‘__pfn_to_page’
/usr/src/linux-headers-2.6.32-bpo.5-common/include/linux/mm.h:318: error: ‘CONFIG_PAGE_OFFSETUL’ undeclared (first use in this function)
/usr/src/linux-headers-2.6.32-bpo.5-common/include/linux/mm.h:318: warning: initialization makes pointer from integer without a cast
In file included from /usr/src/linux-headers-2.6.32-bpo.5-common/arch/x86/include/asm/pci.h:4,
                 from /usr/src/linux-headers-2.6.32-bpo.5-common/include/linux/pci.h:1131,
                 from devproc.c:7:
/usr/src/linux-headers-2.6.32-bpo.5-common/include/linux/mm.h: In function ‘lowmem_page_address’:
/usr/src/linux-headers-2.6.32-bpo.5-common/include/linux/mm.h:592: warning: implicit declaration of function ‘__page_to_pfn’
/usr/src/linux-headers-2.6.32-bpo.5-common/include/linux/mm.h:592: error: ‘CONFIG_PAGE_OFFSETUL’ undeclared (first use in this function)
In file included from /usr/src/linux-headers-2.6.32-bpo.5-common/include/linux/dma-mapping.h:7,
                 from /usr/src/linux-headers-2.6.32-bpo.5-common/include/asm-generic/pci-dma-compat.h:7,
                 from /usr/src/linux-headers-2.6.32-bpo.5-common/arch/x86/include/asm/pci.h:128,
                 from /usr/src/linux-headers-2.6.32-bpo.5-common/include/linux/pci.h:1131,
                 from devproc.c:7:
/usr/src/linux-headers-2.6.32-bpo.5-common/include/linux/scatterlist.h: In function ‘sg_set_buf’:
/usr/src/linux-headers-2.6.32-bpo.5-common/include/linux/scatterlist.h:112: error: ‘CONFIG_PAGE_OFFSETUL’ undeclared (first use in this function)
/usr/src/linux-headers-2.6.32-bpo.5-common/include/linux/scatterlist.h:112: warning: passing argument 2 of ‘sg_set_page’ makes pointer from integer without a cast
In file included from /usr/src/linux-headers-2.6.32-bpo.5-common/include/linux/hardirq.h:10,
                 from /usr/src/linux-headers-2.6.32-bpo.5-common/include/linux/pagemap.h:15,
                 from devproc.c:8:
/usr/src/linux-headers-2.6.32-bpo.5-common/arch/x86/include/asm/hardirq.h: At top level:
/usr/src/linux-headers-2.6.32-bpo.5-common/arch/x86/include/asm/hardirq.h:29: error: requested alignment is not a constant
In file included from devproc.c:8:
/usr/src/linux-headers-2.6.32-bpo.5-common/include/linux/pagemap.h: In function ‘fault_in_pages_writeable’:
/usr/src/linux-headers-2.6.32-bpo.5-common/include/linux/pagemap.h:398: warning: implicit declaration of function ‘__copy_to_user_ll’
make[2]: *** [devproc.o] Ошибка 1
make[2]: Leaving directory `/home/wlan/BARDY_LINUX/ADP64Z4/W64Z4'
make[1]: *** [all] Ошибка 2
make[1]: Leaving directory `/home/wlan/BARDY_LINUX/ADP64Z4'
make: *** [total] Ошибка 2

 

Revise this Paste

Your Name: Code Language: